BDBM50160647 2-[3-(3-Iodo-benzyloxy)-phenylethynyl]-6-methyl-pyridine::CHEMBL182858
SMILES Cc1cccc(n1)C#Cc1cccc(OCc2cccc(I)c2)c1
InChI Key InChIKey=FZWYBEHKBQZHRT-UHFFFAOYSA-N
Data  1 IC50
  Tab Delimited (TSV)   2D SDfile   Computed 3D by Vconf -m prep SDfile
Find this compound or compounds like it in BindingDB:
Activity Spreadsheet -- Enzyme Inhibition Constant Data from BindingDB
Found 1 hit for monomerid = 50160647
TargetMetabotropic glutamate receptor 5(Rattus norvegicus (Rat))
Yale University
Curated by ChEMBL
LigandPNGBDBM50160647(2-[3-(3-Iodo-benzyloxy)-phenylethynyl]-6-methyl-py...)
Affinity DataIC50:  1.98E+3nM. Assay description: Concentration required for 50% growth inhibition of rat metabotropic glutamate receptor 5 was determined using inositol phosphate hydrolysis assay
In DepthDetails ArticlePubMed