BDBM50161623 8-Bromo-1-ethyl-7-methoxy-2,3,4,5-tetrahydro-1H-benzo[d]azepine::CHEMBL426235
SMILES CCC1CNCCc2cc(OC)c(Br)cc12
InChI Key InChIKey=QSLHEIFNJPYBLS-UHFFFAOYSA-N
Data  3 EC50
  Tab Delimited (TSV)   2D SDfile   Computed 3D by Vconf -m prep SDfile
Find this compound or compounds like it in BindingDB:
Activity Spreadsheet -- Enzyme Inhibition Constant Data from BindingDB
Found 3 hits for monomerid = 50161623
Target5-hydroxytryptamine receptor 2B(Homo sapiens (Human))
Arena Pharmaceuticals
Curated by ChEMBL
LigandPNGBDBM50161623(8-Bromo-1-ethyl-7-methoxy-2,3,4,5-tetrahydro-1H-be...)
Affinity DataEC50:  40nM. Assay description: Effective concentration towards 5-hydroxytryptamine 2C receptors transfected in HEK-293 cells was determined by measuring [3H]-phosphoinositol releas...
In DepthDetails ArticlePubMed
Target5-hydroxytryptamine receptor 2A(Homo sapiens (Human))
Arena Pharmaceuticals
Curated by ChEMBL
LigandPNGBDBM50161623(8-Bromo-1-ethyl-7-methoxy-2,3,4,5-tetrahydro-1H-be...)
Affinity DataEC50:  100nM. Assay description: Effective concentration towards 5-hydroxytryptamine 2B receptors transfected in HEK-293 cells was determined by measuring [3H]-phosphoinositol releas...
In DepthDetails ArticlePubMed
Target5-hydroxytryptamine receptor 2C(Homo sapiens (Human))
Arena Pharmaceuticals
Curated by ChEMBL
LigandPNGBDBM50161623(8-Bromo-1-ethyl-7-methoxy-2,3,4,5-tetrahydro-1H-be...)
Affinity DataEC50:  11nM. Assay description: Effective concentration towards 5-hydroxytryptamine 2A receptors transfected in HEK-293 cells was determined by measuring [3H]-phosphoinositol releas...
In DepthDetails ArticlePubMed