BDBM50161630 8-Bromo-7-isopropoxy-1-methyl-2,3,4,5-tetrahydro-1H-benzo[d]azepine::CHEMBL415029
SMILES CC(C)Oc1cc2CCNCC(C)c2cc1Br
InChI Key InChIKey=OKANWZMGTYYNOW-UHFFFAOYSA-N
Data  3 EC50
  Tab Delimited (TSV)   2D SDfile   Computed 3D by Vconf -m prep SDfile
Find this compound or compounds like it in BindingDB:
Activity Spreadsheet -- Enzyme Inhibition Constant Data from BindingDB
Found 3 hits for monomerid = 50161630
Target5-hydroxytryptamine receptor 2B(Homo sapiens (Human))
Arena Pharmaceuticals
Curated by ChEMBL
LigandPNGBDBM50161630(8-Bromo-7-isopropoxy-1-methyl-2,3,4,5-tetrahydro-1...)
Affinity DataEC50:  230nM. Assay description: Effective concentration towards 5-hydroxytryptamine 2C receptors transfected in HEK-293 cells was determined by measuring [3H]-phosphoinositol releas...
In DepthDetails ArticlePubMed
Target5-hydroxytryptamine receptor 2A(Homo sapiens (Human))
Arena Pharmaceuticals
Curated by ChEMBL
LigandPNGBDBM50161630(8-Bromo-7-isopropoxy-1-methyl-2,3,4,5-tetrahydro-1...)
Affinity DataEC50:  97nM. Assay description: Effective concentration towards 5-hydroxytryptamine 2B receptors transfected in HEK-293 cells was determined by measuring [3H]-phosphoinositol releas...
In DepthDetails ArticlePubMed
Target5-hydroxytryptamine receptor 2C(Homo sapiens (Human))
Arena Pharmaceuticals
Curated by ChEMBL
LigandPNGBDBM50161630(8-Bromo-7-isopropoxy-1-methyl-2,3,4,5-tetrahydro-1...)
Affinity DataEC50:  68nM. Assay description: Effective concentration towards 5-hydroxytryptamine 2A receptors transfected in HEK-293 cells was determined by measuring [3H]-phosphoinositol releas...
In DepthDetails ArticlePubMed