BDBM50163346 CHEMBL3792967
SMILES O=C1N(CCCCCCCN2CCN(Cc3ccccc3)CC2)C(=O)c2ccccc12
InChI Key InChIKey=QSQQTKHAGMWUGS-UHFFFAOYSA-N
Data  1 IC50
  Tab Delimited (TSV)   2D SDfile   Computed 3D by Vconf -m prep SDfile
Find this compound or compounds like it in BindingDB:
Activity Spreadsheet -- Enzyme Inhibition Constant Data from BindingDB
Found 1 hit for monomerid = 50163346
TargetAcetylcholinesterase(Electrophorus electricus (Electric eel))
Chinese Academy Of Agricultural Sciences
Curated by ChEMBL
LigandPNGBDBM50163346(CHEMBL3792967)
Affinity DataIC50:  54nM. Assay description: Inhibition of electric eel AChE preincubated for 15 mins followed by addition of acetylthiocholine iodide substrate by Ellman's method-based spectrop...
In DepthDetails ArticlePubMed