BDBM50163587 (3-Ethyl-2-methyl-quinolin-6-yl)-indan-2-yl-methanone::CHEMBL366448
SMILES CCc1cc2cc(ccc2nc1C)C(=O)C1Cc2ccccc2C1
InChI Key InChIKey=VCVWFHVRSCOUBG-UHFFFAOYSA-N
Data  2 IC50
  Tab Delimited (TSV)   2D SDfile   Computed 3D by Vconf -m prep SDfile
Find this compound or compounds like it in BindingDB:
Activity Spreadsheet -- Enzyme Inhibition Constant Data from BindingDB
Found 2 hits for monomerid = 50163587
TargetMetabotropic glutamate receptor 1(RAT)
Janssen-Cilag
Curated by ChEMBL
LigandPNGBDBM50163587((3-Ethyl-2-methyl-quinolin-6-yl)-indan-2-yl-methan...)
Affinity DataIC50:  56nM. Assay description: Inhibitory concentration against rat metabotropic glutamate receptor 1
In DepthDetails ArticlePubMed
TargetMetabotropic glutamate receptor 1(Homo sapiens (Human))
Janssen-Cilag
Curated by ChEMBL
LigandPNGBDBM50163587((3-Ethyl-2-methyl-quinolin-6-yl)-indan-2-yl-methan...)
Affinity DataIC50:  1.18E+3nM. Assay description: Inhibitory concentration against human metabotropic glutamate receptor
In DepthDetails ArticlePubMed