BDBM50163599 Bicyclo[2.2.1]hept-2-yl-(3-ethyl-2-methyl-quinolin-6-yl)-methanone::CHEMBL174218
SMILES CCc1cc2cc(ccc2nc1C)C(=O)C1CC2CCC1C2
InChI Key InChIKey=JDFWQYOHYDSAAI-UHFFFAOYSA-N
Data  2 IC50
  Tab Delimited (TSV)   2D SDfile   Computed 3D by Vconf -m prep SDfile
Find this compound or compounds like it in BindingDB:
Activity Spreadsheet -- Enzyme Inhibition Constant Data from BindingDB
Found 2 hits for monomerid = 50163599
TargetMetabotropic glutamate receptor 1(RAT)
Janssen-Cilag
Curated by ChEMBL
LigandPNGBDBM50163599(Bicyclo[2.2.1]hept-2-yl-(3-ethyl-2-methyl-quinolin...)
Affinity DataIC50:  13nM. Assay description: Inhibitory concentration against rat metabotropic glutamate receptor 1
In DepthDetails ArticlePubMed
TargetMetabotropic glutamate receptor 1(Homo sapiens (Human))
Janssen-Cilag
Curated by ChEMBL
LigandPNGBDBM50163599(Bicyclo[2.2.1]hept-2-yl-(3-ethyl-2-methyl-quinolin...)
Affinity DataIC50: >1.00E+4nM. Assay description: Inhibitory concentration against human metabotropic glutamate receptor
In DepthDetails ArticlePubMed