BDBM50164399 CHEMBL3797313
SMILES CCN(Cc1cc(=O)n2c(CCCO)c(C)sc2n1)c1ccc(F)cc1
InChI Key InChIKey=OZBUYWSMWLUMTI-UHFFFAOYSA-N
Data  3 EC50
  Tab Delimited (TSV)   2D SDfile   Computed 3D by Vconf -m prep SDfile
Find this compound or compounds like it in BindingDB:
Activity Spreadsheet -- Enzyme Inhibition Constant Data from BindingDB
Found 3 hits for monomerid = 50164399
TargetGlutamate receptor 2(Homo sapiens (Human))
Pharmaron-Beijing
Curated by ChEMBL
LigandPNGBDBM50164399(CHEMBL3797313)
Affinity DataEC50:  1.50E+3nM. Assay description: Positive allosteric modulation of human GluA2 AMPAR flop isomer expressed in Dox-inducible cells measured every 5 mins by BD calcium indicator dye ba...
In DepthDetails ArticlePubMed
TargetGlutamate receptor ionotropic, NMDA 1/2A(Homo sapiens (Human))
Pharmaron-Beijing
Curated by ChEMBL
LigandPNGBDBM50164399(CHEMBL3797313)
Affinity DataEC50:  183nM. Assay description: Positive allosteric modulation of GluN1/GluN2A NMDAR (unknown origin) expressed in Dox-inducible cells measured every 5 mins by BD calcium indicator ...
In DepthDetails ArticlePubMed
TargetGlutamate receptor 2(Homo sapiens (Human))
Pharmaron-Beijing
Curated by ChEMBL
LigandPNGBDBM50164399(CHEMBL3797313)
Affinity DataEC50:  3.32E+4nM. Assay description: Positive allosteric modulation of human GluA2 AMPAR flip isomer expressed in Dox-inducible cells measured every 5 mins by BD calcium indicator dye ba...
In DepthDetails ArticlePubMed