BDBM50165030 6-(3,5-Bis-benzyloxy-benzoylamino)-nicotinic acid::CHEMBL194102
SMILES OC(=O)c1ccc(NC(=O)c2cc(OCc3ccccc3)cc(OCc3ccccc3)c2)nc1
InChI Key InChIKey=GDIONXWSZRJUGV-UHFFFAOYSA-N
Data  1 EC50
  Tab Delimited (TSV)   2D SDfile   Computed 3D by Vconf -m prep SDfile
Find this compound or compounds like it in BindingDB:
Activity Spreadsheet -- Enzyme Inhibition Constant Data from BindingDB
Found 1 hit for monomerid = 50165030
TargetHexokinase-4(Homo sapiens (Human))
Astrazeneca
Curated by ChEMBL
LigandPNGBDBM50165030(6-(3,5-Bis-benzyloxy-benzoylamino)-nicotinic acid ...)
Affinity DataEC50:  400nM. Assay description: Potency in Glucokinase activation assay
In DepthDetails ArticlePubMed