BDBM50166112 (E)-Octadec-9-enoic acid (R)-2,2-difluoro-1-phosphonooxymethyl-ethyl ester::CHEMBL192861
SMILES CCCCCCCC\C=C\CCCCCCCC(=O)O[C@H](COP(O)(O)=O)C(F)F
InChI Key InChIKey=FJPWQJDOXYSIEW-JBVUFVISSA-N
Data  1 EC50
  Tab Delimited (TSV)   2D SDfile   Computed 3D by Vconf -m prep SDfile
Find this compound or compounds like it in BindingDB:
Activity Spreadsheet -- Enzyme Inhibition Constant Data from BindingDB
Found 1 hit for monomerid = 50166112
TargetLysophosphatidic acid receptor 3(Homo sapiens (Human))
The University Of Utah
Curated by ChEMBL
LigandPNGBDBM50166112((E)-Octadec-9-enoic acid (R)-2,2-difluoro-1-phosph...)
Affinity DataEC50: >1.00E+4nM. Assay description: Agonistic activity as increased intracellular calcium level by human LPA3 receptor expressed in Sf9 cells
In DepthDetails ArticlePubMed