BDBM50168271 (S)-3-Amino-4-((S)-2-cyano-pyrrolidin-1-yl)-N-(2-methyl-1-phenyl-propyl)-4-oxo-butyramide::CHEMBL191274
SMILES CC(C)C(NC(=O)C[C@H](N)C(=O)N1CCC[C@H]1C#N)c1ccccc1
InChI Key InChIKey=VYOKUVBOFVFIRJ-MZQXSQAVSA-N
Data  2 IC50
  Tab Delimited (TSV)   2D SDfile   Computed 3D by Vconf -m prep SDfile
Find this compound or compounds like it in BindingDB:
Activity Spreadsheet -- Enzyme Inhibition Constant Data from BindingDB
Found 2 hits for monomerid = 50168271
TargetDipeptidyl peptidase 8(Homo sapiens (Human))
National Health Research Institutes
Curated by ChEMBL
LigandPNGBDBM50168271((S)-3-Amino-4-((S)-2-cyano-pyrrolidin-1-yl)-N-(2-m...)
Affinity DataIC50:  3.06E+3nM. Assay description: Inhibitory concentration against Dipeptidyl-peptidase 8
In DepthDetails ArticlePubMed
TargetDipeptidyl peptidase 4(Homo sapiens (Human))
National Health Research Institutes
Curated by ChEMBL
LigandPNGBDBM50168271((S)-3-Amino-4-((S)-2-cyano-pyrrolidin-1-yl)-N-(2-m...)
Affinity DataIC50:  212nM. Assay description: Inhibitory concentration against Dipeptidyl-peptidase IV [DPP-IV]
In DepthDetails ArticlePubMed