BDBM50168533 2-Phenyl-N-[1-((E)-3-phenyl-allyl)-piperidin-4-yl]-acetamide::CHEMBL185696
SMILES O=C(Cc1ccccc1)NC1CCN(C\C=C\c2ccccc2)CC1
InChI Key InChIKey=HQNQUYJMHCNZLQ-KPKJPENVSA-N
Data  1 IC50
  Tab Delimited (TSV)   2D SDfile   Computed 3D by Vconf -m prep SDfile
Find this compound or compounds like it in BindingDB:
Activity Spreadsheet -- Enzyme Inhibition Constant Data from BindingDB
Found 1 hit for monomerid = 50168533
TargetMelanin-concentrating hormone receptor 1(Mus musculus)
Abbott Laboratories
Curated by ChEMBL
LigandPNGBDBM50168533(2-Phenyl-N-[1-((E)-3-phenyl-allyl)-piperidin-4-yl]...)
Affinity DataIC50: >1.00E+4nM. Assay description: Inhibitory concentration required for binding affinity against mouse MCHr1 competing human neuronal IMR32 cells receptor in a radiometric binding ass...
In DepthDetails ArticlePubMed