BDBM50168609 (S)-3-{[5-(3-Chloro-phenyl)-thiophene-2-carbonyl]-methyl-amino}-pyrrolidine-1-carboxylic acid methyl-((R)-1-methyl-pyrrolidin-3-yl)-amide::CHEMBL188659
SMILES CN([C@@H]1CCN(C)C1)C(=O)N1CC[C@@H](C1)N(C)C(=O)c1ccc(s1)-c1cccc(Cl)c1
InChI Key InChIKey=JVOYYMOKYAFJGF-MOPGFXCFSA-N
Data  1 KI
  Tab Delimited (TSV)   2D SDfile   Computed 3D by Vconf -m prep SDfile
Find this compound or compounds like it in BindingDB:
Activity Spreadsheet -- Enzyme Inhibition Constant Data from BindingDB
Found 1 hit for monomerid = 50168609
TargetMelanin-concentrating hormone receptor 1(Homo sapiens (Human))
Neurocrine Biosciences
Curated by ChEMBL
LigandPNGBDBM50168609((S)-3-{[5-(3-Chloro-phenyl)-thiophene-2-carbonyl]-...)
Affinity DataKi:  320nM. Assay description: Binding affinity towards the human MCH-R1 receptor by displacing [125I]-Tyr13]-MCH radioligand in HEK293 cells, Data is average of 3 or more independ...
In DepthDetails ArticlePubMed