BDBM50169072 CHEMBL3806125
SMILES Clc1ccc(Oc2cncc3sc(cc23)C(=O)C2CC2)cc1
InChI Key InChIKey=LGCGYNVLQBBQDK-UHFFFAOYSA-N
Data  1 IC50
  Tab Delimited (TSV)   2D SDfile   Computed 3D by Vconf -m prep SDfile
Find this compound or compounds like it in BindingDB:
Activity Spreadsheet -- Enzyme Inhibition Constant Data from BindingDB
Found 1 hit for monomerid = 50169072
TargetCyclin-C(Homo sapiens (Human))
Genentech
Curated by ChEMBL
LigandPNGBDBM50169072(CHEMBL3806125)
Affinity DataIC50:  59nM. Assay description: Inhibition of full length human recombinant His-tagged CDK8/Cyclin C expressed in baculovirus expression system by fluorescence polarization assay
In DepthDetails ArticlePubMed