BDBM50169075 CHEMBL3805581
SMILES CC(C)NC(=O)c1cc2c(Oc3ccc(Cl)cc3)cncc2s1
InChI Key InChIKey=XMIBQFKFHHNBRI-UHFFFAOYSA-N
Data  1 IC50
  Tab Delimited (TSV)   2D SDfile   Computed 3D by Vconf -m prep SDfile
Find this compound or compounds like it in BindingDB:
Activity Spreadsheet -- Enzyme Inhibition Constant Data from BindingDB
Found 1 hit for monomerid = 50169075
TargetCyclin-C(Homo sapiens (Human))
Genentech
Curated by ChEMBL
LigandPNGBDBM50169075(CHEMBL3805581)
Affinity DataIC50:  100nM. Assay description: Inhibition of full length human recombinant His-tagged CDK8/Cyclin C expressed in baculovirus expression system by fluorescence polarization assay
In DepthDetails ArticlePubMed