BDBM50170176 3-Bromo-N-[4-(4-dimethylamino-quinazolin-2-ylamino)-cyclohexyl]-benzamide::CHEMBL359510
SMILES CN(C)c1nc(N[C@@H]2CC[C@@H](CC2)NC(=O)c2cccc(Br)c2)nc2ccccc12
InChI Key InChIKey=RFTNZWFCHDUSMZ-HDICACEKSA-N
Data  2 IC50
  Tab Delimited (TSV)   2D SDfile   Computed 3D by Vconf -m prep SDfile
Find this compound or compounds like it in BindingDB:
Activity Spreadsheet -- Enzyme Inhibition Constant Data from BindingDB
Found 2 hits for monomerid = 50170176
TargetAlpha-2A adrenergic receptor(Homo sapiens (Human))
Taisho Pharmaceutical
Curated by ChEMBL
LigandPNGBDBM50170176(3-Bromo-N-[4-(4-dimethylamino-quinazolin-2-ylamino...)
Affinity DataIC50:  63nM. Assay description: Inhibitory activity against alpha-2A adrenergic receptor by using [3H]MK-912 as radioligand expressed in COS-1 cells
In DepthDetails ArticlePubMed
TargetMelanin-concentrating hormone receptor 1(Homo sapiens (Human))
Taisho Pharmaceutical
Curated by ChEMBL
LigandPNGBDBM50170176(3-Bromo-N-[4-(4-dimethylamino-quinazolin-2-ylamino...)
Affinity DataIC50:  5.90nM. Assay description: Inhibitory activity against human CA-MCH-R1 (Melanin-concentrating hormone receptor 1) by using [125I](Phe13,Tyr19)MCH as radioligand expressed in HE...
In DepthDetails ArticlePubMed