BDBM50170194 CHEMBL367355::trans-4-Bromo-N-{4-[(4-dimethylamino-quinazolin-2-ylamino)-methyl]-cyclohexylmethyl}-2-trifluoromethoxy-benzamide
SMILES CN(C)c1nc(NCC2CCC(CNC(=O)c3ccc(Br)cc3OC(F)(F)F)CC2)nc2ccccc12
InChI Key InChIKey=KENQBAJESGJICP-UHFFFAOYSA-N
Data  3 IC50
  Tab Delimited (TSV)   2D SDfile   Computed 3D by Vconf -m prep SDfile
Find this compound or compounds like it in BindingDB:
Activity Spreadsheet -- Enzyme Inhibition Constant Data from BindingDB
Found 3 hits for monomerid = 50170194
TargetMelanin-concentrating hormone receptor 1(Homo sapiens (Human))
Taisho Pharmaceutical
Curated by ChEMBL
LigandPNGBDBM50170194(CHEMBL367355 | trans-4-Bromo-N-{4-[(4-dimethylamin...)
Affinity DataIC50:  1.50E+3nM. Assay description: Inhibitory activity against human CA-MCH-R1 (Melanin-concentrating hormone receptor 1) by using [125I](Phe13,Tyr19)MCH as radioligand expressed in HE...
In DepthDetails ArticlePubMed
TargetAlpha-2A adrenergic receptor(Homo sapiens (Human))
Taisho Pharmaceutical
Curated by ChEMBL
LigandPNGBDBM50170194(CHEMBL367355 | trans-4-Bromo-N-{4-[(4-dimethylamin...)
Affinity DataIC50:  9.90nM. Assay description: Inhibitory activity against alpha-2A adrenergic receptor by using [3H]MK-912 as radioligand expressed in COS-1 cells
In DepthDetails ArticlePubMed
TargetNeuropeptide Y receptor type 5(Homo sapiens (Human))
Taisho Pharmaceutical
Curated by ChEMBL
LigandPNGBDBM50170194(CHEMBL367355 | trans-4-Bromo-N-{4-[(4-dimethylamin...)
Affinity DataIC50:  470nM. Assay description: Inhibitory activity against neuropeptide Y receptor type 5 by using [125I]PYY as radioligand expressed in COS-1 cells
In DepthDetails ArticlePubMed