BDBM50170465 6-Phenoxymethyl-pyridine-2-carboxylic acid [4-(1-hydroxycarbamoyl-2-phenyl-ethyl)-thiazol-2-yl]-amide::CHEMBL189520
SMILES ONC(=O)C(Cc1ccccc1)c1csc(NC(=O)c2cccc(COc3ccccc3)n2)n1
InChI Key InChIKey=SHGKPNDEAARIND-UHFFFAOYSA-N
Data  2 IC50
  Tab Delimited (TSV)   2D SDfile   Computed 3D by Vconf -m prep SDfile
Find this compound or compounds like it in BindingDB:
Activity Spreadsheet -- Enzyme Inhibition Constant Data from BindingDB
Found 2 hits for monomerid = 50170465
TargetcGMP-specific 3',5'-cyclic phosphodiesterase(Homo sapiens (Human))
Sumitomo Pharmaceuticals
Curated by ChEMBL
LigandPNGBDBM50170465(6-Phenoxymethyl-pyridine-2-carboxylic acid [4-(1-h...)
Affinity DataIC50:  830nM. Assay description: Inhibitory concentration against Phosphodiesterase type 5
In DepthDetails ArticlePubMed
LigandPNGBDBM50170465(6-Phenoxymethyl-pyridine-2-carboxylic acid [4-(1-h...)
Affinity DataIC50:  1.36E+3nM. Assay description: Inhibitory concentration against Phosphodiesterase type 1
In DepthDetails ArticlePubMed