BDBM50170509 (R)-2-{[6-(4-Acetyl-2-ethyl-5-hydroxy-phenoxymethyl)-pyridine-2-carbonyl]-amino}-propionic acid::CHEMBL190773
SMILES CCc1cc(C(C)=O)c(O)cc1OCc1cccc(n1)C(=O)N[C@H](C)C(O)=O
InChI Key InChIKey=PWGHBWNHVJNBNN-LLVKDONJSA-N
Data  1 IC50
  Tab Delimited (TSV)   2D SDfile   Computed 3D by Vconf -m prep SDfile
Find this compound or compounds like it in BindingDB:
Activity Spreadsheet -- Enzyme Inhibition Constant Data from BindingDB
Found 1 hit for monomerid = 50170509
TargetcGMP-specific 3',5'-cyclic phosphodiesterase(Homo sapiens (Human))
Sumitomo Pharmaceuticals
Curated by ChEMBL
LigandPNGBDBM50170509((R)-2-{[6-(4-Acetyl-2-ethyl-5-hydroxy-phenoxymethy...)
Affinity DataIC50:  1.03E+3nM. Assay description: Inhibitory concentration against Phosphodiesterase type 5
In DepthDetails ArticlePubMed