BDBM50170522 CHEMBL188233::N-{6-[(hydroxyamino)carbonyl]pyridin-2-yl}-6-(phenoxymethyl)pyridine-2-carboxamide
SMILES ONC(=O)c1cccc(NC(=O)c2cccc(COc3ccccc3)n2)n1
InChI Key InChIKey=PGGFZBMZJLJSEV-UHFFFAOYSA-N
Data  2 IC50
  Tab Delimited (TSV)   2D SDfile   Computed 3D by Vconf -m prep SDfile
Find this compound or compounds like it in BindingDB:
Activity Spreadsheet -- Enzyme Inhibition Constant Data from BindingDB
Found 2 hits for monomerid = 50170522
LigandPNGBDBM50170522(CHEMBL188233 | N-{6-[(hydroxyamino)carbonyl]pyridi...)
Affinity DataIC50: >1.00E+4nM. Assay description: Inhibitory concentration against Phosphodiesterase type 1
In DepthDetails ArticlePubMed
TargetcGMP-specific 3',5'-cyclic phosphodiesterase(Homo sapiens (Human))
Sumitomo Pharmaceuticals
Curated by ChEMBL
LigandPNGBDBM50170522(CHEMBL188233 | N-{6-[(hydroxyamino)carbonyl]pyridi...)
Affinity DataIC50:  1.47E+3nM. Assay description: Inhibitory concentration against Phosphodiesterase type 5
In DepthDetails ArticlePubMed