BDBM50170535 2-{[6-(4-Acetyl-2-ethyl-5-hydroxy-phenoxymethyl)-pyridine-2-carbonyl]-amino}-3-methyl-butyric acid::CHEMBL363734
SMILES CCc1cc(C(C)=O)c(O)cc1OCc1cccc(n1)C(=O)NC(C(C)C)C(O)=O
InChI Key InChIKey=OYBGRDJWIRSUBL-UHFFFAOYSA-N
Data  1 IC50
  Tab Delimited (TSV)   2D SDfile   Computed 3D by Vconf -m prep SDfile
Find this compound or compounds like it in BindingDB:
Activity Spreadsheet -- Enzyme Inhibition Constant Data from BindingDB
Found 1 hit for monomerid = 50170535
TargetcGMP-specific 3',5'-cyclic phosphodiesterase(Homo sapiens (Human))
Sumitomo Pharmaceuticals
Curated by ChEMBL
LigandPNGBDBM50170535(2-{[6-(4-Acetyl-2-ethyl-5-hydroxy-phenoxymethyl)-p...)
Affinity DataIC50:  1.24E+3nM. Assay description: Inhibitory concentration against Phosphodiesterase type 5
In DepthDetails ArticlePubMed