BDBM50170552 CHEMBL365147::Naphthalene-1-carboxylic acid (4-hydroxycarbamoylmethyl-thiazol-2-yl)-amide
SMILES ONC(=O)Cc1csc(NC(=O)c2cccc3ccccc23)n1
InChI Key InChIKey=CLKQIZVTONEYRO-UHFFFAOYSA-N
Data  2 IC50
  Tab Delimited (TSV)   2D SDfile   Computed 3D by Vconf -m prep SDfile
Find this compound or compounds like it in BindingDB:
Activity Spreadsheet -- Enzyme Inhibition Constant Data from BindingDB
Found 2 hits for monomerid = 50170552
LigandPNGBDBM50170552(CHEMBL365147 | Naphthalene-1-carboxylic acid (4-hy...)
Affinity DataIC50:  1.00E+3nM. Assay description: Inhibitory concentration against Phosphodiesterase type 1
In DepthDetails ArticlePubMed
TargetcGMP-specific 3',5'-cyclic phosphodiesterase(Homo sapiens (Human))
Sumitomo Pharmaceuticals
Curated by ChEMBL
LigandPNGBDBM50170552(CHEMBL365147 | Naphthalene-1-carboxylic acid (4-hy...)
Affinity DataIC50:  1.10E+3nM. Assay description: Inhibitory concentration against Phosphodiesterase type 5
In DepthDetails ArticlePubMed