BDBM50172700 (4R,5R)-3,3-Dibutyl-7-dimethylamino-5-(3-fluoro-4-methoxy-phenyl)-1,1-dioxo-2,3,4,5-tetrahydro-1H-1lambda*6*-benzo[b]thiepin-4-ol::CHEMBL196459
SMILES CCCCC1(CCCC)CS(=O)(=O)c2ccc(cc2[C@H]([C@H]1O)c1ccc(OC)c(F)c1)N(C)C
InChI Key InChIKey=WFYJIQZQSQYGTO-CLJLJLNGSA-N
Data  1 IC50
  Tab Delimited (TSV)   2D SDfile   Computed 3D by Vconf -m prep SDfile
Find this compound or compounds like it in BindingDB:
Activity Spreadsheet -- Enzyme Inhibition Constant Data from BindingDB
Found 1 hit for monomerid = 50172700
TargetIleal sodium/bile acid cotransporter(Homo sapiens (Human))
Pfizer
Curated by ChEMBL
LigandPNGBDBM50172700((4R,5R)-3,3-Dibutyl-7-dimethylamino-5-(3-fluoro-4-...)
Affinity DataIC50:  3.60nM. Assay description: In vitro inhibition of ASBT mediated uptake of [14C]taurocholate (5 uM) in baby hamster cells expressing human IBAT
In DepthDetails ArticlePubMed