BDBM50174296 3-(4-(5-(4-fluorophenyl)-1,2,4-oxadiazol-3-yl)bicyclo[2.2.2]octan-1-yl)-4-methyl-5-(2-(trifluoromethyl)phenyl)-4H-1,2,4-triazole::CHEMBL370657
SMILES Cn1c(nnc1C12CCC(CC1)(CC2)c1noc(n1)-c1ccc(F)cc1)-c1ccccc1C(F)(F)F
InChI Key InChIKey=AFADWEMXXIYGCL-UHFFFAOYSA-N
Data  1 IC50
  Tab Delimited (TSV)   2D SDfile   Computed 3D by Vconf -m prep SDfile
Find this compound or compounds like it in BindingDB:
Activity Spreadsheet -- Enzyme Inhibition Constant Data from BindingDB
Found 1 hit for monomerid = 50174296
Target11-beta-hydroxysteroid dehydrogenase 1(Homo sapiens (Human))
Merck
Curated by ChEMBL
LigandPNGBDBM50174296(3-(4-(5-(4-fluorophenyl)-1,2,4-oxadiazol-3-yl)bicy...)
Affinity DataIC50:  2nM. Assay description: Inhibitory activity against human 11beta-HSD1
In DepthDetails ArticlePubMed