BDBM50174300 3-(2-(difluoromethoxy)phenyl)-5-(4-(3-(4-fluorophenyl)-1,2,4-oxadiazol-5-yl)bicyclo[2.2.2]octan-1-yl)-4-methyl-4H-1,2,4-triazole::CHEMBL200816
SMILES Cn1c(nnc1C12CCC(CC1)(CC2)c1nc(no1)-c1ccc(F)cc1)-c1ccccc1OC(F)F
InChI Key InChIKey=UEQOTLYIRXKYII-UHFFFAOYSA-N
Data  2 IC50
  Tab Delimited (TSV)   2D SDfile   Computed 3D by Vconf -m prep SDfile
Find this compound or compounds like it in BindingDB:
Activity Spreadsheet -- Enzyme Inhibition Constant Data from BindingDB
Found 2 hits for monomerid = 50174300
Target11-beta-hydroxysteroid dehydrogenase 1(Homo sapiens (Human))
Merck
Curated by ChEMBL
LigandPNGBDBM50174300(3-(2-(difluoromethoxy)phenyl)-5-(4-(3-(4-fluorophe...)
Affinity DataIC50:  9.30nM. Assay description: Inhibitory activity against human 11beta-HSD1
In DepthDetails ArticlePubMed
Target11-beta-hydroxysteroid dehydrogenase 1(Mus musculus (mouse))
Merck
Curated by ChEMBL
LigandPNGBDBM50174300(3-(2-(difluoromethoxy)phenyl)-5-(4-(3-(4-fluorophe...)
Affinity DataIC50:  5.20nM. Assay description: Inhibitory activity against mouse 11beta-HSD1
In DepthDetails ArticlePubMed