BDBM50174322 CHEMBL3809533
SMILES COc1cccc(\C=C\C(=O)c2ccc(Nc3ncnc4ccccc34)cc2)c1
InChI Key InChIKey=OIZHHNGXBUBAGQ-NTEUORMPSA-N
Data  2 IC50
  Tab Delimited (TSV)   2D SDfile   Computed 3D by Vconf -m prep SDfile
Find this compound or compounds like it in BindingDB:
Activity Spreadsheet -- Enzyme Inhibition Constant Data from BindingDB
Found 2 hits for monomerid = 50174322
TargetATP-dependent translocase ABCB1(Homo sapiens (Human))
University Of Bonn
Curated by ChEMBL
LigandPNGBDBM50174322(CHEMBL3809533)
Affinity DataIC50:  5.57E+3nM. Assay description: Inhibition of ABCB1 in human A2780/ADR cells incubated for 30 mins measured up to 3600 secs with time intervals of 60 secs by calcein accumulation as...
In DepthDetails ArticlePubMed
TargetBroad substrate specificity ATP-binding cassette transporter ABCG2(Homo sapiens (Human))
University Of Bonn
Curated by ChEMBL
LigandPNGBDBM50174322(CHEMBL3809533)
Affinity DataIC50:  680nM. Assay description: Inhibition of human C-terminal GFP-tagged ABCG2 expressed in MDCK2 cells using pheophorbide A as substrate preincubated for 20 mins followed by subst...
In DepthDetails ArticlePubMed