BDBM50174329 CHEMBL3810368
SMILES COc1ccc(\C=C\C(=O)c2cccc(Nc3nc(nc4ccccc34)-c3ccccc3)c2)cc1OC
InChI Key InChIKey=PCKPPLRHUNRNEH-BMRADRMJSA-N
Data  1 IC50
  Tab Delimited (TSV)   2D SDfile   Computed 3D by Vconf -m prep SDfile
Find this compound or compounds like it in BindingDB:
Activity Spreadsheet -- Enzyme Inhibition Constant Data from BindingDB
Found 1 hit for monomerid = 50174329
TargetBroad substrate specificity ATP-binding cassette transporter ABCG2(Homo sapiens (Human))
University Of Bonn
Curated by ChEMBL
LigandPNGBDBM50174329(CHEMBL3810368)
Affinity DataIC50:  460nM. Assay description: Inhibition of human C-terminal GFP-tagged ABCG2 expressed in MDCK2 cells using pheophorbide A as substrate preincubated for 20 mins followed by subst...
In DepthDetails ArticlePubMed