BDBM50174334 CHEMBL3809529
SMILES COc1ccc(\C=C\C(=O)c2ccc(Nc3nc(nc4ccccc34)-c3ccc(OC)c(OC)c3)cc2)cc1OC
InChI Key InChIKey=UELXDXUOBOULEV-CXUHLZMHSA-N
Data  2 IC50
  Tab Delimited (TSV)   2D SDfile   Computed 3D by Vconf -m prep SDfile
Find this compound or compounds like it in BindingDB:
Activity Spreadsheet -- Enzyme Inhibition Constant Data from BindingDB
Found 2 hits for monomerid = 50174334
TargetBroad substrate specificity ATP-binding cassette transporter ABCG2(Homo sapiens (Human))
University Of Bonn
Curated by ChEMBL
LigandPNGBDBM50174334(CHEMBL3809529)
Affinity DataIC50:  190nM. Assay description: Inhibition of human C-terminal GFP-tagged ABCG2 expressed in MDCK2 cells using pheophorbide A as substrate preincubated for 20 mins followed by subst...
In DepthDetails ArticlePubMed
TargetATP-dependent translocase ABCB1(Homo sapiens (Human))
University Of Bonn
Curated by ChEMBL
LigandPNGBDBM50174334(CHEMBL3809529)
Affinity DataIC50:  1.49E+4nM. Assay description: Inhibition of ABCB1 in human A2780/ADR cells incubated for 30 mins measured up to 3600 secs with time intervals of 60 secs by calcein accumulation as...
In DepthDetails ArticlePubMed