BDBM50174564 CHEMBL3808579
SMILES Fc1ccc(\C=C2\S\C(NC2=O)=N/c2nc3cc(sc3s2)-c2ccc(Cl)cc2)cc1
InChI Key InChIKey=CMOPTOFHJYFAKJ-RQZCQDPDSA-N
Data  1 IC50
  Tab Delimited (TSV)   2D SDfile   Computed 3D by Vconf -m prep SDfile
Find this compound or compounds like it in BindingDB:
Activity Spreadsheet -- Enzyme Inhibition Constant Data from BindingDB
Found 1 hit for monomerid = 50174564
TargetM-phase inducer phosphatase 1(Homo sapiens (Human))
Universit£
Curated by ChEMBL
LigandPNGBDBM50174564(CHEMBL3808579)
Affinity DataIC50:  7.80E+3nM. Assay description: Inhibition of human recombinant full length GST-tagged CDC25A transfected in Escherichia coli BL21-DE3 using 3-O-methylfluorescein phosphate as subst...
In DepthDetails ArticlePubMed