BDBM50175478 3-{2-[4-(2,5-dimethoxy-phenyl)-piperazin-1-yl]-ethyl}-7-methyl-5,6,7,8-tetrahydro-3H-pyrido[4',3':4,5]thieno[2,3-d]pyrimidin-4-one::CHEMBL197011
SMILES COc1ccc(OC)c(c1)N1CCN(CCn2cnc3sc4CN(C)CCc4c3c2=O)CC1
InChI Key InChIKey=MQMNWSMVVMWOMS-UHFFFAOYSA-N
Data  2 KI
  Tab Delimited (TSV)   2D SDfile   Computed 3D by Vconf -m prep SDfile
Find this compound or compounds like it in BindingDB:
Activity Spreadsheet -- Enzyme Inhibition Constant Data from BindingDB
Found 2 hits for monomerid = 50175478
Target5-hydroxytryptamine receptor 1A(Homo sapiens (Human))
Abbott
Curated by ChEMBL
LigandPNGBDBM50175478(3-{2-[4-(2,5-dimethoxy-phenyl)-piperazin-1-yl]-eth...)
Affinity DataKi:  24.2nM. Assay description: Displacement of [35S]GTPgammaS from human recombinant 5HT1A receptor
In DepthDetails ArticlePubMed
Target5-hydroxytryptamine receptor 1B(Homo sapiens (Human))
Abbott
Curated by ChEMBL
LigandPNGBDBM50175478(3-{2-[4-(2,5-dimethoxy-phenyl)-piperazin-1-yl]-eth...)
Affinity DataKi:  50.2nM. Assay description: Inhibitory activity against human recombinant 5HT1B receptor co-expressed with G-protein chimera Gqo5 in HEK293 cells by FLIPR
In DepthDetails ArticlePubMed