BDBM50178686 (2S,4R)-4-isopentylglutamic acid::CHEMBL197176
SMILES CC(C)CC[C@H](C[C@H](N)C(O)=O)C(O)=O
InChI Key InChIKey=SBLWSMSFRMKPMN-SFYZADRCSA-N
Data  3 KI
  Tab Delimited (TSV)   2D SDfile   Computed 3D by Vconf -m prep SDfile
Find this compound or compounds like it in BindingDB:
Activity Spreadsheet -- Enzyme Inhibition Constant Data from BindingDB
Found 3 hits for monomerid = 50178686
TargetExcitatory amino acid transporter 2(Homo sapiens (Human))
Université
Curated by ChEMBL
LigandPNGBDBM50178686((2S,4R)-4-isopentylglutamic acid | CHEMBL197176)
Affinity DataKi:  2.60E+4nM. Assay description: Binding affinity to human EAAT2 expressed in HEK293 cells in FMP (FLPR) assay
In DepthDetails ArticlePubMed
TargetExcitatory amino acid transporter 1(Homo sapiens (Human))
Université
Curated by ChEMBL
LigandPNGBDBM50178686((2S,4R)-4-isopentylglutamic acid | CHEMBL197176)
Affinity DataKi:  2.90E+4nM. Assay description: Binding affinity to human EAAT1 expressed in HEK293 cells in FMP (FLPR) assay
In DepthDetails ArticlePubMed
TargetExcitatory amino acid transporter 3(Homo sapiens (Human))
Université
Curated by ChEMBL
LigandPNGBDBM50178686((2S,4R)-4-isopentylglutamic acid | CHEMBL197176)
Affinity DataKi:  8.10E+4nM. Assay description: Binding affinity to human EAAT3 expressed in HEK293 cells in FMP (FLPR) assay
In DepthDetails ArticlePubMed