BDBM50178990 CHEMBL2286425
SMILES CC(C)(C)N(NC(=O)c1cccc(Cl)c1)C(=O)c1ccccc1Cl
InChI Key InChIKey=YVAIPWQNMHDDIV-UHFFFAOYSA-N
Data  1 IC50  5 EC50
  Tab Delimited (TSV)   2D SDfile   Computed 3D by Vconf -m prep SDfile
Find this compound or compounds like it in BindingDB:
Activity Spreadsheet -- Enzyme Inhibition Constant Data from BindingDB
Found 6 hits for monomerid = 50178990
TargetATP-dependent translocase ABCB1(Homo sapiens (Human))
Kyoto University
Curated by ChEMBL
LigandPNGBDBM50178990(CHEMBL2286425)
Affinity DataIC50:  4.57E+4nM. Assay description: Inhibition of human P-glycoprotein transfected in pig LLC-GA5-COL150 cells assessed as quinidine transport from apical to basolateral side preincubat...
In DepthDetails ArticlePubMed
TargetEcdysone receptor(Spodoptera littoralis)
Ghent University
Curated by ChEMBL
LigandPNGBDBM50178990(CHEMBL2286425)
Affinity DataEC50:  1.70E+3nM. Assay description: Agonist activity at ecdysone receptor in Spodoptera littoralis Sl2 cells after 24 hr by luciferase reporter gene assay
In DepthDetails ArticlePubMed
TargetProtein ultraspiracle(Drosophila melanogaster)
Ghent University
Curated by ChEMBL
LigandPNGBDBM50178990(CHEMBL2286425)
Affinity DataEC50:  1.66E+4nM. Assay description: Agonist activity at ecdysone receptor in Drosophila melanogaster S2 cells after 24 hr by luciferase reporter gene assay
In DepthDetails ArticlePubMed
TargetProtein ultraspiracle(Drosophila melanogaster)
Ghent University
Curated by ChEMBL
LigandPNGBDBM50178990(CHEMBL2286425)
Affinity DataEC50:  1.20E+3nM. Assay description: Agonist activity at ecdysone receptor in Drosophila melanogaster B2 cells assessed as reduction in cell density
In DepthDetails ArticlePubMed
TargetEcdysone receptor(Bombyx mori)
Ghent University
Curated by ChEMBL
LigandPNGBDBM50178990(CHEMBL2286425)
Affinity DataEC50:  155nM. Assay description: Agonist activity at ecdysone receptor in Bombyx mori Bm5 cells after 24 hr by luciferase reporter gene assay
In DepthDetails ArticlePubMed
TargetEcdysone receptor(Bombyx mori)
Ghent University
Curated by ChEMBL
LigandPNGBDBM50178990(CHEMBL2286425)
Affinity DataEC50:  309nM. Assay description: Agonist activity at ecdysone receptor in Bombyx mori Bm5 cells after 24 hr by luciferase reporter gene assay
In DepthDetails ArticlePubMed