BDBM50182067 CHEMBL439158::N-{2-[2-(5-bromo-2-methoxy-phenyl)-ethyl]-3-fluoro-benzoyl}-N'-piperidin-4-ylmethyl-guanidine
SMILES COc1ccc(Br)cc1CCc1c(F)cccc1C(=O)NC(N)=NCC1CCNCC1
InChI Key InChIKey=OSDSDPCHMUIWBC-UHFFFAOYSA-N
Data  1 KI  1 IC50
  Tab Delimited (TSV)   2D SDfile   Computed 3D by Vconf -m prep SDfile
Find this compound or compounds like it in BindingDB:
Activity Spreadsheet -- Enzyme Inhibition Constant Data from BindingDB
Found 2 hits for monomerid = 50182067
TargetMelanocortin receptor 4(Homo sapiens (Human))
Millennium Pharmaceuticals
Curated by ChEMBL
LigandPNGBDBM50182067(CHEMBL439158 | N-{2-[2-(5-bromo-2-methoxy-phenyl)-...)
Affinity DataKi:  13nM. Assay description: Binding affinity to MC4R by membrane filtration assay
In DepthDetails ArticlePubMed
TargetMelanocortin receptor 4(Homo sapiens (Human))
Millennium Pharmaceuticals
Curated by ChEMBL
LigandPNGBDBM50182067(CHEMBL439158 | N-{2-[2-(5-bromo-2-methoxy-phenyl)-...)
Affinity DataIC50:  31nM. Assay description: Antagonist activity against MC4R by cAMP functional assay
In DepthDetails ArticlePubMed