BDBM50182315 (2S,3S,4R,5R)-4-hydroxy-N-methyl-5-(6-(methylamino)-9H-purin-9-yl)-3-(methylsulfonamido)-tetrahydrofuran-2-carboxamide::CHEMBL205355
SMILES CNC(=O)[C@H]1O[C@H]([C@H](O)[C@@H]1NS(C)(=O)=O)n1cnc2c(NC)ncnc12
InChI Key InChIKey=MHKLYHIJZQFICG-VPFIQFBESA-N
Data  1 KI
  Tab Delimited (TSV)   2D SDfile   Computed 3D by Vconf -m prep SDfile
Find this compound or compounds like it in BindingDB:
Activity Spreadsheet -- Enzyme Inhibition Constant Data from BindingDB
Found 1 hit for monomerid = 50182315
TargetAdenosine receptor A3(Homo sapiens (Human))
Pfizer
Curated by ChEMBL
LigandPNGBDBM50182315((2S,3S,4R,5R)-4-hydroxy-N-methyl-5-(6-(methylamino...)
Affinity DataKi: >3.00E+3nM. Assay description: Binding affinity to human adenosine A3 receptor
In DepthDetails ArticlePubMed