BDBM50184259 2-(2-chloro-4-(methyl(3-(7-propyl-3-(trifluoromethyl)benzo[d]isoxazol-6-yloxy)propyl)amino)phenyl)acetic acid::CHEMBL208967
SMILES CCCc1c(OCCCN(C)c2ccc(CC(O)=O)c(Cl)c2)ccc2c(noc12)C(F)(F)F
InChI Key InChIKey=JRJIJEXVKDFRTL-UHFFFAOYSA-N
Data  3 IC50  2 EC50
  Tab Delimited (TSV)   2D SDfile   Computed 3D by Vconf -m prep SDfile
Find this compound or compounds like it in BindingDB:
Activity Spreadsheet -- Enzyme Inhibition Constant Data from BindingDB
Found 5 hits for monomerid = 50184259
TargetOxysterols receptor LXR-alpha(Homo sapiens (Human))
Merck Research Laboratories
Curated by ChEMBL
LigandPNGBDBM50184259(2-(2-chloro-4-(methyl(3-(7-propyl-3-(trifluorometh...)
Affinity DataEC50:  170nM. Assay description: Activity at LXR alpha as beta-lactamase transactivation in CHO cells
In DepthDetails ArticlePubMed
TargetOxysterols receptor LXR-beta(Homo sapiens (Human))
Merck Research Laboratories
Curated by ChEMBL
LigandPNGBDBM50184259(2-(2-chloro-4-(methyl(3-(7-propyl-3-(trifluorometh...)
Affinity DataIC50:  10nM. Assay description: Inhibition of LXR beta
In DepthDetails ArticlePubMed
TargetPeroxisome proliferator-activated receptor delta(Homo sapiens (Human))
Merck Research Laboratories
Curated by ChEMBL
LigandPNGBDBM50184259(2-(2-chloro-4-(methyl(3-(7-propyl-3-(trifluorometh...)
Affinity DataIC50:  1.40E+3nM. Assay description: Inhibition of PPAR delta
In DepthDetails ArticlePubMed
TargetOxysterols receptor LXR-alpha(Homo sapiens (Human))
Merck Research Laboratories
Curated by ChEMBL
LigandPNGBDBM50184259(2-(2-chloro-4-(methyl(3-(7-propyl-3-(trifluorometh...)
Affinity DataIC50:  12nM. Assay description: Activity at LXR alpha as beta-lactamase transactivation in CHO cells
In DepthDetails ArticlePubMed
TargetOxysterols receptor LXR-beta(Homo sapiens (Human))
Merck Research Laboratories
Curated by ChEMBL
LigandPNGBDBM50184259(2-(2-chloro-4-(methyl(3-(7-propyl-3-(trifluorometh...)
Affinity DataEC50:  124nM. Assay description: Activity at LXR beta as beta-lactamase transactivation in CHO cells
In DepthDetails ArticlePubMed