BDBM50184262 2-oxo-1-(3-(7-propyl-3-(trifluoromethyl)benzo[d]isoxazol-6-yloxy)propyl)indoline-5-carboxylic acid::CHEMBL207382
SMILES CCCc1c(OCCCN2C(=O)Cc3cc(ccc23)C(O)=O)ccc2c(noc12)C(F)(F)F
InChI Key InChIKey=JBHHUSIDAMWIJB-UHFFFAOYSA-N
Data  2 IC50  2 EC50
  Tab Delimited (TSV)   2D SDfile   Computed 3D by Vconf -m prep SDfile
Find this compound or compounds like it in BindingDB:
Activity Spreadsheet -- Enzyme Inhibition Constant Data from BindingDB
Found 4 hits for monomerid = 50184262
TargetOxysterols receptor LXR-alpha(Homo sapiens (Human))
Merck Research Laboratories
Curated by ChEMBL
LigandPNGBDBM50184262(2-oxo-1-(3-(7-propyl-3-(trifluoromethyl)benzo[d]is...)
Affinity DataIC50:  97nM. Assay description: Inhibition of LXR alpha
In DepthDetails ArticlePubMed
TargetOxysterols receptor LXR-alpha(Homo sapiens (Human))
Merck Research Laboratories
Curated by ChEMBL
LigandPNGBDBM50184262(2-oxo-1-(3-(7-propyl-3-(trifluoromethyl)benzo[d]is...)
Affinity DataEC50:  3.00E+3nM. Assay description: Activity at LXR alpha as beta-lactamase transactivation in CHO cells
In DepthDetails ArticlePubMed
TargetOxysterols receptor LXR-beta(Homo sapiens (Human))
Merck Research Laboratories
Curated by ChEMBL
LigandPNGBDBM50184262(2-oxo-1-(3-(7-propyl-3-(trifluoromethyl)benzo[d]is...)
Affinity DataEC50:  4.40E+3nM. Assay description: Activity at LXR beta as beta-lactamase transactivation in CHO cells
In DepthDetails ArticlePubMed
TargetOxysterols receptor LXR-beta(Homo sapiens (Human))
Merck Research Laboratories
Curated by ChEMBL
LigandPNGBDBM50184262(2-oxo-1-(3-(7-propyl-3-(trifluoromethyl)benzo[d]is...)
Affinity DataIC50:  700nM. Assay description: Inhibition of LXR beta
In DepthDetails ArticlePubMed