BDBM50184264 2-(2-(methyl(3-(7-propyl-3-(trifluoromethyl)benzo[d]isoxazol-6-yloxy)propyl)amino)thiazol-5-yl)acetic acid::CHEMBL381064
SMILES CCCc1c(OCCCN(C)c2ncc(CC(O)=O)s2)ccc2c(noc12)C(F)(F)F
InChI Key InChIKey=OVJGYBFXJVQSHK-UHFFFAOYSA-N
Data  2 IC50  2 EC50
  Tab Delimited (TSV)   2D SDfile   Computed 3D by Vconf -m prep SDfile
Find this compound or compounds like it in BindingDB:
Activity Spreadsheet -- Enzyme Inhibition Constant Data from BindingDB
Found 4 hits for monomerid = 50184264
TargetOxysterols receptor LXR-beta(Homo sapiens (Human))
Merck Research Laboratories
Curated by ChEMBL
LigandPNGBDBM50184264(2-(2-(methyl(3-(7-propyl-3-(trifluoromethyl)benzo[...)
Affinity DataIC50:  100nM. Assay description: Inhibition of LXR beta
In DepthDetails ArticlePubMed
TargetOxysterols receptor LXR-alpha(Homo sapiens (Human))
Merck Research Laboratories
Curated by ChEMBL
LigandPNGBDBM50184264(2-(2-(methyl(3-(7-propyl-3-(trifluoromethyl)benzo[...)
Affinity DataIC50:  67nM. Assay description: Activity at LXR alpha as beta-lactamase transactivation in CHO cells
In DepthDetails ArticlePubMed
TargetOxysterols receptor LXR-beta(Homo sapiens (Human))
Merck Research Laboratories
Curated by ChEMBL
LigandPNGBDBM50184264(2-(2-(methyl(3-(7-propyl-3-(trifluoromethyl)benzo[...)
Affinity DataEC50:  650nM. Assay description: Activity at LXR beta as beta-lactamase transactivation in CHO cells
In DepthDetails ArticlePubMed
TargetOxysterols receptor LXR-alpha(Homo sapiens (Human))
Merck Research Laboratories
Curated by ChEMBL
LigandPNGBDBM50184264(2-(2-(methyl(3-(7-propyl-3-(trifluoromethyl)benzo[...)
Affinity DataEC50:  1.10E+3nM. Assay description: Activity at LXR alpha as beta-lactamase transactivation in CHO cells
In DepthDetails ArticlePubMed