BDBM50184992 CHEMBL3823046
SMILES CCCCCCCCCSC(C)C(N)=O
InChI Key InChIKey=RZYSYBMLOXBABO-UHFFFAOYSA-N
Data  2 IC50
  Tab Delimited (TSV)   2D SDfile   Computed 3D by Vconf -m prep SDfile
Find this compound or compounds like it in BindingDB:
Activity Spreadsheet -- Enzyme Inhibition Constant Data from BindingDB
Found 2 hits for monomerid = 50184992
TargetEpoxide hydrolase 1(Homo sapiens (Human))
University Of California Davis
Curated by ChEMBL
LigandPNGBDBM50184992(CHEMBL3823046)
Affinity DataIC50:  1.58E+3nM. Assay description: Inhibition of human mEH using CMNGC as substrate preincubated for 5 mins followed by substrate addition and measured at 30 secs interval for 10 mins ...
In DepthDetails ArticlePubMed
TargetEpoxide hydrolase 1(Homo sapiens (Human))
University Of California Davis
Curated by ChEMBL
LigandPNGBDBM50184992(CHEMBL3823046)
Affinity DataIC50:  6.00E+3nM. Assay description: Inhibition of recombinant human mEH expressed in baculovirus expression system assessed as formation of 6-methoxy-2-naphthaldehyde preincubated for 5...
In DepthDetails ArticlePubMed