BDBM50185346 1-(3-(4-octylphenoxy)-2-oxopropyl)-1H-indole-6-carboxylic acid::1-[3-(4-octylphenoxy)-2-oxopropyl]indole-6-carboxylic acid::CHEMBL205941
SMILES CCCCCCCCc1ccc(OCC(=O)Cn2ccc3ccc(cc23)C(O)=O)cc1
InChI Key InChIKey=YRYOEVQZRFTJRH-UHFFFAOYSA-N
Data  4 IC50
  Tab Delimited (TSV)   2D SDfile   Computed 3D by Vconf -m prep SDfile
Find this compound or compounds like it in BindingDB:
Activity Spreadsheet -- Enzyme Inhibition Constant Data from BindingDB
Found 4 hits for monomerid = 50185346
TargetCytosolic phospholipase A2(Homo sapiens (Human))
University Of MüNster
Curated by ChEMBL
LigandPNGBDBM50185346(1-(3-(4-octylphenoxy)-2-oxopropyl)-1H-indole-6-car...)
Affinity DataIC50:  1.10E+3nM. Assay description: Inhibition of human isolated cPLA2alpha by vescicle assay
In DepthDetails ArticlePubMed
TargetCytosolic phospholipase A2(Homo sapiens (Human))
University Of MüNster
Curated by ChEMBL
LigandPNGBDBM50185346(1-(3-(4-octylphenoxy)-2-oxopropyl)-1H-indole-6-car...)
Affinity DataIC50:  1.10E+3nM. Assay description: Inhibition of cPLA2 in human platelets assessed as arachidonic acid release
In DepthDetails ArticlePubMed
TargetCytosolic phospholipase A2(Homo sapiens (Human))
University Of MüNster
Curated by ChEMBL
LigandPNGBDBM50185346(1-(3-(4-octylphenoxy)-2-oxopropyl)-1H-indole-6-car...)
Affinity DataIC50:  1.10E+3nM. Assay description: Inhibition of cPLA2 from human platelets by RP-HPLC
In DepthDetails ArticlePubMed
TargetCytosolic phospholipase A2(Homo sapiens (Human))
University Of MüNster
Curated by ChEMBL
LigandPNGBDBM50185346(1-(3-(4-octylphenoxy)-2-oxopropyl)-1H-indole-6-car...)
Affinity DataIC50:  4.70E+3nM. Assay description: Inhibition of cPLA2alpha activity assessed by A23187-induced arachidonic acid release in human platelet
In DepthDetails ArticlePubMed