BDBM50186431 CHEMBL210529::US8618147, 8::tert-butyl 4-(2-(3-(4-hydroxyphenyl)-4,5-dihydroisoxazol-5-yl)acetamido)butylcarbamate
SMILES CC(C)(C)OC(=O)NCCCCNC(=O)CC1CC(=NO1)c1ccc(O)cc1
InChI Key InChIKey=SDSVEMLPYFFBLM-UHFFFAOYSA-N
Data  2 IC50
  Tab Delimited (TSV)   2D SDfile   Computed 3D by Vconf -m prep SDfile
Find this compound or compounds like it in BindingDB:
Activity Spreadsheet -- Enzyme Inhibition Constant Data from BindingDB
Found 2 hits for monomerid = 50186431
TargetMacrophage migration inhibitory factor(Homo sapiens (Human))
Institute For Medical Research
Curated by ChEMBL
LigandPNGBDBM50186431(CHEMBL210529 | US8618147, 8 | tert-butyl 4-(2-(3-(...)
Affinity DataIC50:  8.50E+3nM. Assay description: Inhibition of MIF tautomerase activity
In DepthDetails ArticlePubMed
TargetMacrophage migration inhibitory factor(Mus musculus (Mouse))
The Feinstein Institute For Medical Research
US Patent
LigandPNGBDBM50186431(CHEMBL210529 | US8618147, 8 | tert-butyl 4-(2-(3-(...)
Affinity DataIC50:  8.50E+3nMpH: 7.2 T: 2°C. Assay description: MIF tautomerase activity was measured by UV-Visible recording spectrophotometry (SHIMADZU, UV1600U). A fresh stock solution of L-dopachrome methyl es...
In DepthDetails US Patent