BDBM50186594 2,6-diphenyl-9H-purine::CHEMBL381729
SMILES c1nc2nc(nc(-c3ccccc3)c2[nH]1)-c1ccccc1
InChI Key InChIKey=WNVFFQZYOFELQA-UHFFFAOYSA-N
Data  3 KI
  Tab Delimited (TSV)   2D SDfile   Computed 3D by Vconf -m prep SDfile
Find this compound or compounds like it in BindingDB:
Activity Spreadsheet -- Enzyme Inhibition Constant Data from BindingDB
Found 3 hits for monomerid = 50186594
TargetAdenosine receptor A1(Homo sapiens (Human))
Leiden/Amsterdam Center For Drug Research
Curated by ChEMBL
LigandPNGBDBM50186594(2,6-diphenyl-9H-purine | CHEMBL381729)
Affinity DataKi:  4.10nM. Assay description: Displacement of [3H]DPCPX from human adenosine A1 receptor expressed in CHO cells
In DepthDetails ArticlePubMed
TargetAdenosine receptor A3(Homo sapiens (Human))
Leiden/Amsterdam Center For Drug Research
Curated by ChEMBL
LigandPNGBDBM50186594(2,6-diphenyl-9H-purine | CHEMBL381729)
Affinity DataKi:  38nM. Assay description: Displacement of [125I]AB-MECA from human adenosine A3 receptor expressed in HEK293 cells
In DepthDetails ArticlePubMed
TargetAdenosine receptor A2a(Homo sapiens (Human))
Leiden/Amsterdam Center For Drug Research
Curated by ChEMBL
LigandPNGBDBM50186594(2,6-diphenyl-9H-purine | CHEMBL381729)
Affinity DataKi:  53nM. Assay description: Displacement of [3H]ZM 241385 from human adenosine A2a receptor expressed in HEK293 cells
In DepthDetails ArticlePubMed