BDBM50187434 1-(5-(vinyloxy)pyridin-3-yl)piperazine::1-(5-(vinyloxypyridin-3-yl)piperazine::CHEMBL208765
SMILES C=COc1cncc(c1)N1CCNCC1
InChI Key InChIKey=VBUZMQUXIQZALI-UHFFFAOYSA-N
Data  2 IC50  1 EC50
  Tab Delimited (TSV)   2D SDfile   Computed 3D by Vconf -m prep SDfile
Find this compound or compounds like it in BindingDB:
Activity Spreadsheet -- Enzyme Inhibition Constant Data from BindingDB
Found 3 hits for monomerid = 50187434
TargetNeuronal acetylcholine receptor subunit alpha-4(Homo sapiens (Human))
University Of Turin
Curated by ChEMBL
LigandPNGBDBM50187434(1-(5-(vinyloxy)pyridin-3-yl)piperazine | 1-(5-(vin...)
Affinity DataIC50:  191nM. Assay description: Displacement of [3H]cytisine from human alpha4beta2 nAChR expressed in HEK293 cells
In DepthDetails ArticlePubMed
TargetNeuronal acetylcholine receptor subunit alpha-4/beta-2(Rattus norvegicus (Rat))
Neurosearch
Curated by ChEMBL
LigandPNGBDBM50187434(1-(5-(vinyloxy)pyridin-3-yl)piperazine | 1-(5-(vin...)
Affinity DataIC50:  190nM. Assay description: Inhibition of [3H]cytisine binding to alpha4beta2 nACHR in Wistar rat cerebral cortical membrane
In DepthDetails ArticlePubMed
TargetNeuronal acetylcholine receptor subunit alpha-4(Homo sapiens (Human))
University Of Turin
Curated by ChEMBL
LigandPNGBDBM50187434(1-(5-(vinyloxy)pyridin-3-yl)piperazine | 1-(5-(vin...)
Affinity DataEC50:  7.59E+3nM. Assay description: Agonist activity at human alpha4beta2 nAChR expressed in HEK293 cells assessed as intracellular calcium level by FLIPR assay
In DepthDetails ArticlePubMed