BDBM50187508 1-(phenylsulfonyl)-1H-indole::1-Benzenesulfonyl-1H-indole::1-Phenylsulfonyl-1H-indole::CHEMBL82224
SMILES O=S(=O)(c1ccccc1)n1ccc2ccccc12
InChI Key InChIKey=VDWLCYCWLIKWBV-UHFFFAOYSA-N
Data  1 KI  1 IC50
  Tab Delimited (TSV)   2D SDfile   Computed 3D by Vconf -m prep SDfile
Find this compound or compounds like it in BindingDB:
Activity Spreadsheet -- Enzyme Inhibition Constant Data from BindingDB
Found 1 hit for monomerid = 50187508
TargetFructose-1,6-bisphosphatase 1(Mus musculus)
University Of Massachusetts
Curated by ChEMBL
LigandPNGBDBM50187508(1-(phenylsulfonyl)-1H-indole | 1-Benzenesulfonyl-1...)
Affinity DataIC50:  1.19E+5nM. Assay description: Inhibition of fructose-1,6-bisphosphatase in mouse liver homogenates by colorimetric phosphate assay
In DepthDetails ArticlePubMed