BDBM50189259 C6S::CHEMBL1417
SMILES COc1ccc2C[C@@H]3[C@@H]4C=C[C@H](OS([O-])(=O)=O)[C@@H]5Oc1c2[C@]45CC[NH+]3C
InChI Key InChIKey=JIYGLXDCNSTUSY-XSSYPUMDSA-N
Data  4 KI
  Tab Delimited (TSV)   2D SDfile   Computed 3D by Vconf -m prep SDfile
Find this compound or compounds like it in BindingDB:
Activity Spreadsheet -- Enzyme Inhibition Constant Data from BindingDB
Found 4 hits for monomerid = 50189259
TargetMu-type opioid receptor(GUINEA PIG)
University Of Kentucky
Curated by ChEMBL
LigandPNGBDBM50189259(C6S | CHEMBL1417)
Affinity DataKi:  39nM. Assay description: Displacement of radiolabeled DAMGO from mu opioid receptor in Hartley guinea pig brain
In DepthDetails ArticlePubMed
TargetDelta-type opioid receptor(Homo sapiens (Human))
University Of Kentucky
Curated by ChEMBL
LigandPNGBDBM50189259(C6S | CHEMBL1417)
Affinity DataKi:  414nM. Assay description: Displacement of radiolabeled DPDPE-Cl from delta opioid receptor in Hartley guinea pig brain
In DepthDetails ArticlePubMed
TargetNociceptin receptor(Cavia porcellus)
University Of Kentucky
Curated by ChEMBL
LigandPNGBDBM50189259(C6S | CHEMBL1417)
Affinity DataKi:  455nM. Assay description: Displacement of radiolabeled NalBzOH from kappa3 opioid receptor in Hartley guinea pig brain
In DepthDetails ArticlePubMed
TargetKappa-type opioid receptor(Cavia porcellus (domestic guinea pig))
University Of Kentucky
Curated by ChEMBL
LigandPNGBDBM50189259(C6S | CHEMBL1417)
Affinity DataKi: >1.00E+4nM. Assay description: Displacement of radiolabeled U69593 from kappa1 opioid receptor in Hartley guinea pig brain
In DepthDetails ArticlePubMed