BDBM50189260 CHEMBL209751::M3B6S
SMILES C[NH+]1CC[C@@]23[C@H]4Oc5c2c(C[C@@H]1[C@@H]3C=C[C@@H]4OS([O-])(=O)=O)ccc5OC(=O)c1ccccc1
InChI Key InChIKey=IQMPFHWIBSSPBS-MJFIPZRTSA-N
Data  4 KI
  Tab Delimited (TSV)   2D SDfile   Computed 3D by Vconf -m prep SDfile
Find this compound or compounds like it in BindingDB:
Activity Spreadsheet -- Enzyme Inhibition Constant Data from BindingDB
Found 4 hits for monomerid = 50189260
TargetMu-type opioid receptor(GUINEA PIG)
University Of Kentucky
Curated by ChEMBL
LigandPNGBDBM50189260(CHEMBL209751 | M3B6S)
Affinity DataKi:  37nM. Assay description: Displacement of radiolabeled DAMGO from mu opioid receptor in Hartley guinea pig brain
In DepthDetails ArticlePubMed
TargetNociceptin receptor(Cavia porcellus)
University Of Kentucky
Curated by ChEMBL
LigandPNGBDBM50189260(CHEMBL209751 | M3B6S)
Affinity DataKi:  513nM. Assay description: Displacement of radiolabeled NalBzOH from kappa3 opioid receptor in Hartley guinea pig brain
In DepthDetails ArticlePubMed
TargetDelta-type opioid receptor(Homo sapiens (Human))
University Of Kentucky
Curated by ChEMBL
LigandPNGBDBM50189260(CHEMBL209751 | M3B6S)
Affinity DataKi:  600nM. Assay description: Displacement of radiolabeled DPDPE-Cl from delta opioid receptor in Hartley guinea pig brain
In DepthDetails ArticlePubMed
TargetKappa-type opioid receptor(Cavia porcellus (domestic guinea pig))
University Of Kentucky
Curated by ChEMBL
LigandPNGBDBM50189260(CHEMBL209751 | M3B6S)
Affinity DataKi: >1.00E+4nM. Assay description: Displacement of radiolabeled U69593 from kappa1 opioid receptor in Hartley guinea pig brain
In DepthDetails ArticlePubMed