BDBM50191044 (3R,3aS,4S,4aS,9aR)-3-ethyl-4-(2-(quinolin-2-yl)vinyl)-3,3a,4,4a,5,6,7,8-octahydronaphtho[2,3-c]furan-1(9aH)-one::CHEMBL217611
SMILES CC[C@H]1OC(=O)[C@@H]2C=C3CCCC[C@H]3[C@H](\C=C\c3ccc4ccccc4n3)[C@H]12
InChI Key InChIKey=KVSBHLJFJHRTJE-DJDHPZHPSA-N
Data  1 IC50
  Tab Delimited (TSV)   2D SDfile   Computed 3D by Vconf -m prep SDfile
Find this compound or compounds like it in BindingDB:
Activity Spreadsheet -- Enzyme Inhibition Constant Data from BindingDB
Found 1 hit for monomerid = 50191044
TargetProteinase-activated receptor 1(Homo sapiens (Human))
Schering-Plough Research Institute
Curated by ChEMBL
LigandPNGBDBM50191044((3R,3aS,4S,4aS,9aR)-3-ethyl-4-(2-(quinolin-2-yl)vi...)
Affinity DataIC50:  1.50E+3nM. Assay description: Binding affinity to PAR1 in human platelet membrane
In DepthDetails ArticlePubMed