BDBM50191047 2-(2-((1R,3R,3aS,4S,4aR,8aS,9aR)-1-methoxy-3-methyl-dodecahydronaphtho[2,3-c]furan-4-yl)vinyl)quinoline::CHEMBL215524
SMILES CO[C@@H]1O[C@H](C)[C@@H]2[C@H]1C[C@@H]1CCCC[C@H]1[C@@H]2\C=C\c1ccc2ccccc2n1
InChI Key InChIKey=DGGSIXWLXADBNJ-RZCDRIDQSA-N
Data  1 IC50
  Tab Delimited (TSV)   2D SDfile   Computed 3D by Vconf -m prep SDfile
Find this compound or compounds like it in BindingDB:
Activity Spreadsheet -- Enzyme Inhibition Constant Data from BindingDB
Found 1 hit for monomerid = 50191047
TargetProteinase-activated receptor 1(Homo sapiens (Human))
Schering-Plough Research Institute
Curated by ChEMBL
LigandPNGBDBM50191047(2-(2-((1R,3R,3aS,4S,4aR,8aS,9aR)-1-methoxy-3-methy...)
Affinity DataIC50:  7.00E+3nM. Assay description: Binding affinity to PAR1 in human platelet membrane
In DepthDetails ArticlePubMed