BDBM50192454 CHEMBL3911264::US10239870, Example 12
SMILES Cc1ncoc1-c1nnc(SCCCN2CC[C@@]3(C[C@H]3c3ccc(cc3)C(F)(F)F)C2)n1C
InChI Key InChIKey=MNAFRWGRFIBAQX-PGRDOPGGSA-N
Data  4 KI
  Tab Delimited (TSV)   2D SDfile   Computed 3D by Vconf -m prep SDfile
Find this compound or compounds like it in BindingDB:
Activity Spreadsheet -- Enzyme Inhibition Constant Data from BindingDB
Found 4 hits for monomerid = 50192454
TargetD(3) dopamine receptor(Rattus norvegicus (Rat))
Indivior
US Patent
LigandPNGBDBM50192454(CHEMBL3911264 | US10239870, Example 12)
Affinity DataKi:  0.631nM. Assay description: [125I]-7OH-PIPAT Binding Assay at rat native D3 receptor on membranes from rat ventral striatum. Homogenates from frozen rat brain ventral striatum (...
In DepthDetails US Patent
TargetD(2) dopamine receptor(Homo sapiens (Human))
Indivior
US Patent
LigandPNGBDBM50192454(CHEMBL3911264 | US10239870, Example 12)
Affinity DataKi:  74.1nM. Assay description: CHO cells stably expressing human dopamine receptor type 2, long variant (hD2L), coupled to Gα16 protein (CHO-Gα16-hD2L) were seeded into b...
In DepthDetails US Patent
TargetD(3) dopamine receptor(Homo sapiens (Human))
Aptuit
Curated by ChEMBL
LigandPNGBDBM50192454(CHEMBL3911264 | US10239870, Example 12)
Affinity DataKi:  129nM. Assay description: Displacement of [3H]-spiperone from human dopamine D3 receptor expressed in CHO-K1 cell membranes after 90 mins by liquid scintillation counting
In DepthDetails ArticlePubMed
TargetD(2) dopamine receptor(Homo sapiens (Human))
Indivior
US Patent
LigandPNGBDBM50192454(CHEMBL3911264 | US10239870, Example 12)
Affinity DataKi:  214nM. Assay description: CHO cells stably expressing human dopamine receptor type 2, long variant (hD2L), coupled to Gα16 protein (CHO-Gα16-hD2L) were re-suspended ...
In DepthDetails US Patent