BDBM50193737 1-(3-(trifluoromethyl)benzyl)-N-(4-fluorophenylsulfonyl)-1H-indole-2-carboxamide::CHEMBL218175
SMILES Fc1ccc(cc1)S(=O)(=O)NC(=O)c1cc2ccccc2n1Cc1cccc(c1)C(F)(F)F
InChI Key InChIKey=KBPGJFYSJKCCLX-UHFFFAOYSA-N
Data  1 IC50
  Tab Delimited (TSV)   2D SDfile   Computed 3D by Vconf -m prep SDfile
Find this compound or compounds like it in BindingDB:
Activity Spreadsheet -- Enzyme Inhibition Constant Data from BindingDB
Found 1 hit for monomerid = 50193737
TargetPeroxisome proliferator-activated receptor gamma(Homo sapiens (Human))
Procter And Gamble Pharmaceuticals
Curated by ChEMBL
LigandPNGBDBM50193737(1-(3-(trifluoromethyl)benzyl)-N-(4-fluorophenylsul...)
Affinity DataIC50:  720nM. Assay description: Displacement of Fluormone from PPAR gamma
In DepthDetails ArticlePubMed