BDBM50195380 CHEMBL387315::N-{4'-[(benzyl-methyl-carbamoyl)-methyl]-biphenyl-4-ylmethyl}-N-(2-dibutylamino-ethyl)-4-pentyl-benzamide
SMILES CCCCCc1ccc(cc1)C(=O)N(CCN(CCCC)CCCC)Cc1ccc(cc1)-c1ccc(CC(=O)N(C)Cc2ccccc2)cc1
InChI Key InChIKey=HVSKDFHVTFRADD-UHFFFAOYSA-N
Data  1 IC50
  Tab Delimited (TSV)   2D SDfile   Computed 3D by Vconf -m prep SDfile
Find this compound or compounds like it in BindingDB:
Activity Spreadsheet -- Enzyme Inhibition Constant Data from BindingDB
Found 1 hit for monomerid = 50195380
TargetPlasmepsin II(Plasmodium falciparum)
Actelion Pharmaceuticals
Curated by ChEMBL
LigandPNGBDBM50195380(CHEMBL387315 | N-{4'-[(benzyl-methyl-carbamoyl)-me...)
Affinity DataIC50:  91nM. Assay description: Inhibition of PM2 by FRET assay
In DepthDetails ArticlePubMed