BDBM50196191 4-[4-iodo-2-[(5-quinoxalinylsulfonyl)amino]benzoyl]-morpholine::CHEMBL216483::N-(5-iodo-2-(morpholine-4-carbonyl)phenyl)quinoxaline-5-sulfonamide
SMILES Ic1ccc(C(=O)N2CCOCC2)c(NS(=O)(=O)c2cccc3nccnc23)c1
InChI Key InChIKey=ZGNZXTPZDMUKIG-UHFFFAOYSA-N
Data  3 KI
  Tab Delimited (TSV)   2D SDfile   Computed 3D by Vconf -m prep SDfile
Find this compound or compounds like it in BindingDB:
Activity Spreadsheet -- Enzyme Inhibition Constant Data from BindingDB
Found 3 hits for monomerid = 50196191
TargetGastrin/cholecystokinin type B receptor(Homo sapiens (Human))
Johnson & Johnson Pharmaceutical Research And Development
Curated by ChEMBL
LigandPNGBDBM50196191(4-[4-iodo-2-[(5-quinoxalinylsulfonyl)amino]benzoyl...)
Affinity DataKi:  32nM. Assay description: Displacement of [125I]CCK8S from human CCK2R
In DepthDetails ArticlePubMed
TargetCholecystokinin receptor type A(Homo sapiens (Human))
Johnson And Johnson Pharmaceutical Research And Development
Curated by ChEMBL
LigandPNGBDBM50196191(4-[4-iodo-2-[(5-quinoxalinylsulfonyl)amino]benzoyl...)
Affinity DataKi: >1.00E+4nM. Assay description: Displacement of [125I]CCK-8S from human CCK1R
In DepthDetails ArticlePubMed
TargetCholecystokinin receptor type A(Homo sapiens (Human))
Johnson And Johnson Pharmaceutical Research And Development
Curated by ChEMBL
LigandPNGBDBM50196191(4-[4-iodo-2-[(5-quinoxalinylsulfonyl)amino]benzoyl...)
Affinity DataKi: <1.00E+4nM. Assay description: Displacement of [125I]CCK8S from human CCK1R
In DepthDetails ArticlePubMed